Skip to content
Permalink
Newer
Older
100644 970 lines (946 sloc) 35.6 KB
saq10002
Oct 26, 2014
1
This file contains any messages produced by compilers while
2
running configure, to aid debugging if configure makes a mistake.
3
4
It was created by Google C++ Testing Framework configure 1.7.0, which was
5
generated by GNU Autoconf 2.68. Invocation command line was
6
7
$ ./configure CC=/usr/bin/gcc CXX=/usr/bin/g++ CFLAGS=-g3 -gdwarf-2 CXXFLAGS=-g3 -gdwarf-2
8
9
## --------- ##
10
## Platform. ##
11
## --------- ##
12
13
hostname = ubuntu
14
uname -m = x86_64
15
uname -r = 3.5.0-17-generic
16
uname -s = Linux
17
uname -v = #28-Ubuntu SMP Tue Oct 9 19:31:23 UTC 2012
18
19
/usr/bin/uname -p = unknown
20
/bin/uname -X = unknown
21
22
/bin/arch = unknown
23
/usr/bin/arch -k = unknown
24
/usr/convex/getsysinfo = unknown
25
/usr/bin/hostinfo = unknown
26
/bin/machine = unknown
27
/usr/bin/oslevel = unknown
28
/bin/universe = unknown
29
30
PATH: /usr/bin
31
PATH: /usr/lib/lightdm/lightdm
32
PATH: /usr/local/sbin
33
PATH: /usr/local/bin
34
PATH: /usr/sbin
35
PATH: /usr/bin
36
PATH: /sbin
37
PATH: /bin
38
PATH: /usr/games
39
PATH: /usr/local/games
40
41
42
## ----------- ##
43
## Core tests. ##
44
## ----------- ##
45
46
configure:2293: checking for a BSD-compatible install
47
configure:2361: result: /usr/bin/install -c
48
configure:2372: checking whether build environment is sane
49
configure:2422: result: yes
50
configure:2563: checking for a thread-safe mkdir -p
51
configure:2602: result: /bin/mkdir -p
52
configure:2615: checking for gawk
53
configure:2645: result: no
54
configure:2615: checking for mawk
55
configure:2631: found /usr/bin/mawk
56
configure:2642: result: mawk
57
configure:2653: checking whether make sets $(MAKE)
58
configure:2675: result: yes
59
configure:2805: checking for gcc
60
configure:2832: result: /usr/bin/gcc
61
configure:3061: checking for C compiler version
62
configure:3070: /usr/bin/gcc --version >&5
63
gcc (Ubuntu/Linaro 4.7.2-2ubuntu1) 4.7.2
64
Copyright (C) 2012 Free Software Foundation, Inc.
65
This is free software; see the source for copying conditions. There is NO
66
warranty; not even for MERCHANTABILITY or FITNESS FOR A PARTICULAR PURPOSE.
67
68
configure:3081: $? = 0
69
configure:3070: /usr/bin/gcc -v >&5
70
Using built-in specs.
71
COLLECT_GCC=/usr/bin/gcc
72
COLLECT_LTO_WRAPPER=/usr/lib/gcc/x86_64-linux-gnu/4.7/lto-wrapper
73
Target: x86_64-linux-gnu
74
Configured with: ../src/configure -v --with-pkgversion='Ubuntu/Linaro 4.7.2-2ubuntu1' --with-bugurl=file:///usr/share/doc/gcc-4.7/README.Bugs --enable-languages=c,c++,go,fortran,objc,obj-c++ --prefix=/usr --program-suffix=-4.7 --enable-shared --enable-linker-build-id --with-system-zlib --libexecdir=/usr/lib --without-included-gettext --enable-threads=posix --with-gxx-include-dir=/usr/include/c++/4.7 --libdir=/usr/lib --enable-nls --with-sysroot=/ --enable-clocale=gnu --enable-libstdcxx-debug --enable-libstdcxx-time=yes --enable-gnu-unique-object --enable-plugin --enable-objc-gc --disable-werror --with-arch-32=i686 --with-tune=generic --enable-checking=release --build=x86_64-linux-gnu --host=x86_64-linux-gnu --target=x86_64-linux-gnu
75
Thread model: posix
76
gcc version 4.7.2 (Ubuntu/Linaro 4.7.2-2ubuntu1)
77
configure:3081: $? = 0
78
configure:3070: /usr/bin/gcc -V >&5
79
gcc: error: unrecognized command line option '-V'
80
gcc: fatal error: no input files
81
compilation terminated.
82
configure:3081: $? = 4
83
configure:3070: /usr/bin/gcc -qversion >&5
84
gcc: error: unrecognized command line option '-qversion'
85
gcc: fatal error: no input files
86
compilation terminated.
87
configure:3081: $? = 4
88
configure:3101: checking whether the C compiler works
89
configure:3123: /usr/bin/gcc -g3 -gdwarf-2 conftest.c >&5
90
configure:3127: $? = 0
91
configure:3175: result: yes
92
configure:3178: checking for C compiler default output file name
93
configure:3180: result: a.out
94
configure:3186: checking for suffix of executables
95
configure:3193: /usr/bin/gcc -o conftest -g3 -gdwarf-2 conftest.c >&5
96
configure:3197: $? = 0
97
configure:3219: result:
98
configure:3241: checking whether we are cross compiling
99
configure:3249: /usr/bin/gcc -o conftest -g3 -gdwarf-2 conftest.c >&5
100
configure:3253: $? = 0
101
configure:3260: ./conftest
102
configure:3264: $? = 0
103
configure:3279: result: no
104
configure:3284: checking for suffix of object files
105
configure:3306: /usr/bin/gcc -c -g3 -gdwarf-2 conftest.c >&5
106
configure:3310: $? = 0
107
configure:3331: result: o
108
configure:3335: checking whether we are using the GNU C compiler
109
configure:3354: /usr/bin/gcc -c -g3 -gdwarf-2 conftest.c >&5
110
configure:3354: $? = 0
111
configure:3363: result: yes
112
configure:3372: checking whether /usr/bin/gcc accepts -g
113
configure:3392: /usr/bin/gcc -c -g conftest.c >&5
114
configure:3392: $? = 0
115
configure:3433: result: yes
116
configure:3450: checking for /usr/bin/gcc option to accept ISO C89
117
configure:3514: /usr/bin/gcc -c -g3 -gdwarf-2 conftest.c >&5
118
configure:3514: $? = 0
119
configure:3527: result: none needed
120
configure:3558: checking for style of include used by make
121
configure:3586: result: GNU
122
configure:3612: checking dependency style of /usr/bin/gcc
123
configure:3723: result: gcc3
124
configure:3850: checking for C++ compiler version
125
configure:3859: /usr/bin/g++ --version >&5
126
g++ (Ubuntu/Linaro 4.7.2-2ubuntu1) 4.7.2
127
Copyright (C) 2012 Free Software Foundation, Inc.
128
This is free software; see the source for copying conditions. There is NO
129
warranty; not even for MERCHANTABILITY or FITNESS FOR A PARTICULAR PURPOSE.
130
131
configure:3870: $? = 0
132
configure:3859: /usr/bin/g++ -v >&5
133
Using built-in specs.
134
COLLECT_GCC=/usr/bin/g++
135
COLLECT_LTO_WRAPPER=/usr/lib/gcc/x86_64-linux-gnu/4.7/lto-wrapper
136
Target: x86_64-linux-gnu
137
Configured with: ../src/configure -v --with-pkgversion='Ubuntu/Linaro 4.7.2-2ubuntu1' --with-bugurl=file:///usr/share/doc/gcc-4.7/README.Bugs --enable-languages=c,c++,go,fortran,objc,obj-c++ --prefix=/usr --program-suffix=-4.7 --enable-shared --enable-linker-build-id --with-system-zlib --libexecdir=/usr/lib --without-included-gettext --enable-threads=posix --with-gxx-include-dir=/usr/include/c++/4.7 --libdir=/usr/lib --enable-nls --with-sysroot=/ --enable-clocale=gnu --enable-libstdcxx-debug --enable-libstdcxx-time=yes --enable-gnu-unique-object --enable-plugin --enable-objc-gc --disable-werror --with-arch-32=i686 --with-tune=generic --enable-checking=release --build=x86_64-linux-gnu --host=x86_64-linux-gnu --target=x86_64-linux-gnu
138
Thread model: posix
139
gcc version 4.7.2 (Ubuntu/Linaro 4.7.2-2ubuntu1)
140
configure:3870: $? = 0
141
configure:3859: /usr/bin/g++ -V >&5
142
g++: error: unrecognized command line option '-V'
143
g++: fatal error: no input files
144
compilation terminated.
145
configure:3870: $? = 4
146
configure:3859: /usr/bin/g++ -qversion >&5
147
g++: error: unrecognized command line option '-qversion'
148
g++: fatal error: no input files
149
compilation terminated.
150
configure:3870: $? = 4
151
configure:3874: checking whether we are using the GNU C++ compiler
152
configure:3893: /usr/bin/g++ -c -g3 -gdwarf-2 conftest.cpp >&5
153
configure:3893: $? = 0
154
configure:3902: result: yes
155
configure:3911: checking whether /usr/bin/g++ accepts -g
156
configure:3931: /usr/bin/g++ -c -g conftest.cpp >&5
157
configure:3931: $? = 0
158
configure:3972: result: yes
159
configure:3997: checking dependency style of /usr/bin/g++
160
configure:4108: result: gcc3
161
configure:4158: checking build system type
162
configure:4172: result: x86_64-unknown-linux-gnu
163
configure:4192: checking host system type
164
configure:4205: result: x86_64-unknown-linux-gnu
165
configure:4246: checking how to print strings
166
configure:4273: result: printf
167
configure:4294: checking for a sed that does not truncate output
168
configure:4358: result: /bin/sed
169
configure:4376: checking for grep that handles long lines and -e
170
configure:4434: result: /bin/grep
171
configure:4439: checking for egrep
172
configure:4501: result: /bin/grep -E
173
configure:4506: checking for fgrep
174
configure:4568: result: /bin/grep -F
175
configure:4603: checking for ld used by /usr/bin/gcc
176
configure:4670: result: /usr/bin/ld
177
configure:4677: checking if the linker (/usr/bin/ld) is GNU ld
178
configure:4692: result: yes
179
configure:4704: checking for BSD- or MS-compatible name lister (nm)
180
configure:4753: result: /usr/bin/nm -B
181
configure:4883: checking the name lister (/usr/bin/nm -B) interface
182
configure:4890: /usr/bin/g++ -c -g3 -gdwarf-2 conftest.cpp >&5
183
configure:4893: /usr/bin/nm -B "conftest.o"
184
configure:4896: output
185
0000000000000000 B some_variable
186
0000000000000000 n wm4.1.5bdbae50d6ecbf9d44334377b3635566
187
configure:4903: result: BSD nm
188
configure:4906: checking whether ln -s works
189
configure:4910: result: yes
190
configure:4918: checking the maximum length of command line arguments
191
configure:5048: result: 1572864
192
configure:5065: checking whether the shell understands some XSI constructs
193
configure:5075: result: yes
194
configure:5079: checking whether the shell understands "+="
195
configure:5085: result: yes
196
configure:5120: checking how to convert x86_64-unknown-linux-gnu file names to x86_64-unknown-linux-gnu format
197
configure:5160: result: func_convert_file_noop
198
configure:5167: checking how to convert x86_64-unknown-linux-gnu file names to toolchain format
199
configure:5187: result: func_convert_file_noop
200
configure:5194: checking for /usr/bin/ld option to reload object files
201
configure:5201: result: -r
202
configure:5275: checking for objdump
203
configure:5291: found /usr/bin/objdump
204
configure:5302: result: objdump
205
configure:5334: checking how to recognize dependent libraries
206
configure:5536: result: pass_all
207
configure:5621: checking for dlltool
208
configure:5651: result: no
209
configure:5681: checking how to associate runtime and link libraries
210
configure:5708: result: printf %s\n
211
configure:5769: checking for ar
212
configure:5785: found /usr/bin/ar
213
configure:5796: result: ar
214
configure:5833: checking for archiver @FILE support
215
configure:5850: /usr/bin/g++ -c -g3 -gdwarf-2 conftest.cpp >&5
216
configure:5850: $? = 0
217
configure:5853: ar cru libconftest.a @conftest.lst >&5
218
configure:5856: $? = 0
219
configure:5861: ar cru libconftest.a @conftest.lst >&5
220
ar: conftest.o: No such file or directory
221
configure:5864: $? = 1
222
configure:5876: result: @
223
configure:5934: checking for strip
224
configure:5950: found /usr/bin/strip
225
configure:5961: result: strip
226
configure:6033: checking for ranlib
227
configure:6049: found /usr/bin/ranlib
228
configure:6060: result: ranlib
229
configure:6162: checking command to parse /usr/bin/nm -B output from /usr/bin/gcc object
230
configure:6282: /usr/bin/g++ -c -g3 -gdwarf-2 conftest.cpp >&5
231
configure:6285: $? = 0
232
configure:6289: /usr/bin/nm -B conftest.o \| sed -n -e 's/^.*[ ]\([ABCDGIRSTW][ABCDGIRSTW]*\)[ ][ ]*\([_A-Za-z][_A-Za-z0-9]*\)$/\1 \2 \2/p' | sed '/ __gnu_lto/d' \> conftest.nm
233
configure:6292: $? = 0
234
configure:6358: /usr/bin/g++ -o conftest -g3 -gdwarf-2 conftest.cpp conftstm.o >&5
235
configure:6361: $? = 0
236
configure:6399: result: ok
237
configure:6436: checking for sysroot
238
configure:6466: result: no
239
configure:6544: /usr/bin/g++ -c -g3 -gdwarf-2 conftest.cpp >&5
240
configure:6547: $? = 0
241
configure:6723: checking for mt
242
configure:6739: found /bin/mt
243
configure:6750: result: mt
244
configure:6773: checking if mt is a manifest tool
245
configure:6779: mt '-?'
246
configure:6787: result: no
247
configure:7429: checking how to run the C preprocessor
248
configure:7460: /usr/bin/gcc -E conftest.c
249
configure:7460: $? = 0
250
configure:7474: /usr/bin/gcc -E conftest.c
251
conftest.c:11:28: fatal error: ac_nonexistent.h: No such file or directory
252
compilation terminated.
253
configure:7474: $? = 1
254
configure: failed program was:
255
| /* confdefs.h */
256
| #define PACKAGE_NAME "Google C++ Testing Framework"
257
| #define PACKAGE_TARNAME "gtest"
258
| #define PACKAGE_VERSION "1.7.0"
259
| #define PACKAGE_STRING "Google C++ Testing Framework 1.7.0"
260
| #define PACKAGE_BUGREPORT "googletestframework@googlegroups.com"
261
| #define PACKAGE_URL ""
262
| #define PACKAGE "gtest"
263
| #define VERSION "1.7.0"
264
| /* end confdefs.h. */
265
| #include <ac_nonexistent.h>
266
configure:7499: result: /usr/bin/gcc -E
267
configure:7519: /usr/bin/gcc -E conftest.c
268
configure:7519: $? = 0
269
configure:7533: /usr/bin/gcc -E conftest.c
270
conftest.c:11:28: fatal error: ac_nonexistent.h: No such file or directory
271
compilation terminated.
272
configure:7533: $? = 1
273
configure: failed program was:
274
| /* confdefs.h */
275
| #define PACKAGE_NAME "Google C++ Testing Framework"
276
| #define PACKAGE_TARNAME "gtest"
277
| #define PACKAGE_VERSION "1.7.0"
278
| #define PACKAGE_STRING "Google C++ Testing Framework 1.7.0"
279
| #define PACKAGE_BUGREPORT "googletestframework@googlegroups.com"
280
| #define PACKAGE_URL ""
281
| #define PACKAGE "gtest"
282
| #define VERSION "1.7.0"
283
| /* end confdefs.h. */
284
| #include <ac_nonexistent.h>
285
configure:7562: checking for ANSI C header files
286
configure:7582: /usr/bin/gcc -c -g3 -gdwarf-2 conftest.c >&5
287
configure:7582: $? = 0
288
configure:7655: /usr/bin/gcc -o conftest -g3 -gdwarf-2 conftest.c >&5
289
configure:7655: $? = 0
290
configure:7655: ./conftest
291
configure:7655: $? = 0
292
configure:7666: result: yes
293
configure:7679: checking for sys/types.h
294
configure:7679: /usr/bin/gcc -c -g3 -gdwarf-2 conftest.c >&5
295
configure:7679: $? = 0
296
configure:7679: result: yes
297
configure:7679: checking for sys/stat.h
298
configure:7679: /usr/bin/gcc -c -g3 -gdwarf-2 conftest.c >&5
299
configure:7679: $? = 0
300
configure:7679: result: yes
301
configure:7679: checking for stdlib.h
302
configure:7679: /usr/bin/gcc -c -g3 -gdwarf-2 conftest.c >&5
303
configure:7679: $? = 0
304
configure:7679: result: yes
305
configure:7679: checking for string.h
306
configure:7679: /usr/bin/gcc -c -g3 -gdwarf-2 conftest.c >&5
307
configure:7679: $? = 0
308
configure:7679: result: yes
309
configure:7679: checking for memory.h
310
configure:7679: /usr/bin/gcc -c -g3 -gdwarf-2 conftest.c >&5
311
configure:7679: $? = 0
312
configure:7679: result: yes
313
configure:7679: checking for strings.h
314
configure:7679: /usr/bin/gcc -c -g3 -gdwarf-2 conftest.c >&5
315
configure:7679: $? = 0
316
configure:7679: result: yes
317
configure:7679: checking for inttypes.h
318
configure:7679: /usr/bin/gcc -c -g3 -gdwarf-2 conftest.c >&5
319
configure:7679: $? = 0
320
configure:7679: result: yes
321
configure:7679: checking for stdint.h
322
configure:7679: /usr/bin/gcc -c -g3 -gdwarf-2 conftest.c >&5
323
configure:7679: $? = 0
324
configure:7679: result: yes
325
configure:7679: checking for unistd.h
326
configure:7679: /usr/bin/gcc -c -g3 -gdwarf-2 conftest.c >&5
327
configure:7679: $? = 0
328
configure:7679: result: yes
329
configure:7693: checking for dlfcn.h
330
configure:7693: /usr/bin/gcc -c -g3 -gdwarf-2 conftest.c >&5
331
configure:7693: $? = 0
332
configure:7693: result: yes
333
configure:7909: checking for objdir
334
configure:7924: result: .libs
335
configure:8195: checking if /usr/bin/gcc supports -fno-rtti -fno-exceptions
336
configure:8213: /usr/bin/gcc -c -g3 -gdwarf-2 -fno-rtti -fno-exceptions conftest.c >&5
337
cc1: warning: command line option '-fno-rtti' is valid for C++/ObjC++ but not for C [enabled by default]
338
configure:8217: $? = 0
339
configure:8230: result: no
340
configure:8557: checking for /usr/bin/gcc option to produce PIC
341
configure:8564: result: -fPIC -DPIC
342
configure:8572: checking if /usr/bin/gcc PIC flag -fPIC -DPIC works
343
configure:8590: /usr/bin/gcc -c -g3 -gdwarf-2 -fPIC -DPIC -DPIC conftest.c >&5
344
configure:8594: $? = 0
345
configure:8607: result: yes
346
configure:8636: checking if /usr/bin/gcc static flag -static works
347
configure:8664: result: yes
348
configure:8679: checking if /usr/bin/gcc supports -c -o file.o
349
configure:8700: /usr/bin/gcc -c -g3 -gdwarf-2 -o out/conftest2.o conftest.c >&5
350
configure:8704: $? = 0
351
configure:8726: result: yes
352
configure:8734: checking if /usr/bin/gcc supports -c -o file.o
353
configure:8781: result: yes
354
configure:8814: checking whether the /usr/bin/gcc linker (/usr/bin/ld -m elf_x86_64) supports shared libraries
355
configure:9971: result: yes
356
configure:10008: checking whether -lc should be explicitly linked in
357
configure:10016: /usr/bin/gcc -c -g3 -gdwarf-2 conftest.c >&5
358
configure:10019: $? = 0
359
configure:10034: /usr/bin/gcc -shared -fPIC -DPIC conftest.o -v -Wl,-soname -Wl,conftest -o conftest 2\>\&1 \| /bin/grep -lc \>/dev/null 2\>\&1
360
configure:10037: $? = 0
361
configure:10051: result: no
362
configure:10211: checking dynamic linker characteristics
363
configure:10722: /usr/bin/gcc -o conftest -g3 -gdwarf-2 -Wl,-rpath -Wl,/foo conftest.c >&5
364
configure:10722: $? = 0
365
configure:10956: result: GNU/Linux ld.so
366
configure:11063: checking how to hardcode library paths into programs
367
configure:11088: result: immediate
368
configure:11628: checking whether stripping libraries is possible
369
configure:11633: result: yes
370
configure:11668: checking if libtool supports shared libraries
371
configure:11670: result: yes
372
configure:11673: checking whether to build shared libraries
373
configure:11694: result: yes
374
configure:11697: checking whether to build static libraries
375
configure:11701: result: yes
376
configure:11724: checking how to run the C++ preprocessor
377
configure:11751: /usr/bin/g++ -E conftest.cpp
378
configure:11751: $? = 0
379
configure:11765: /usr/bin/g++ -E conftest.cpp
380
conftest.cpp:23:28: fatal error: ac_nonexistent.h: No such file or directory
381
compilation terminated.
382
configure:11765: $? = 1
383
configure: failed program was:
384
| /* confdefs.h */
385
| #define PACKAGE_NAME "Google C++ Testing Framework"
386
| #define PACKAGE_TARNAME "gtest"
387
| #define PACKAGE_VERSION "1.7.0"
388
| #define PACKAGE_STRING "Google C++ Testing Framework 1.7.0"
389
| #define PACKAGE_BUGREPORT "googletestframework@googlegroups.com"
390
| #define PACKAGE_URL ""
391
| #define PACKAGE "gtest"
392
| #define VERSION "1.7.0"
393
| #define STDC_HEADERS 1
394
| #define HAVE_SYS_TYPES_H 1
395
| #define HAVE_SYS_STAT_H 1
396
| #define HAVE_STDLIB_H 1
397
| #define HAVE_STRING_H 1
398
| #define HAVE_MEMORY_H 1
399
| #define HAVE_STRINGS_H 1
400
| #define HAVE_INTTYPES_H 1
401
| #define HAVE_STDINT_H 1
402
| #define HAVE_UNISTD_H 1
403
| #define HAVE_DLFCN_H 1
404
| #define LT_OBJDIR ".libs/"
405
| /* end confdefs.h. */
406
| #include <ac_nonexistent.h>
407
configure:11790: result: /usr/bin/g++ -E
408
configure:11810: /usr/bin/g++ -E conftest.cpp
409
configure:11810: $? = 0
410
configure:11824: /usr/bin/g++ -E conftest.cpp
411
conftest.cpp:23:28: fatal error: ac_nonexistent.h: No such file or directory
412
compilation terminated.
413
configure:11824: $? = 1
414
configure: failed program was:
415
| /* confdefs.h */
416
| #define PACKAGE_NAME "Google C++ Testing Framework"
417
| #define PACKAGE_TARNAME "gtest"
418
| #define PACKAGE_VERSION "1.7.0"
419
| #define PACKAGE_STRING "Google C++ Testing Framework 1.7.0"
420
| #define PACKAGE_BUGREPORT "googletestframework@googlegroups.com"
421
| #define PACKAGE_URL ""
422
| #define PACKAGE "gtest"
423
| #define VERSION "1.7.0"
424
| #define STDC_HEADERS 1
425
| #define HAVE_SYS_TYPES_H 1
426
| #define HAVE_SYS_STAT_H 1
427
| #define HAVE_STDLIB_H 1
428
| #define HAVE_STRING_H 1
429
| #define HAVE_MEMORY_H 1
430
| #define HAVE_STRINGS_H 1
431
| #define HAVE_INTTYPES_H 1
432
| #define HAVE_STDINT_H 1
433
| #define HAVE_UNISTD_H 1
434
| #define HAVE_DLFCN_H 1
435
| #define LT_OBJDIR ".libs/"
436
| /* end confdefs.h. */
437
| #include <ac_nonexistent.h>
438
configure:11993: checking for ld used by /usr/bin/g++
439
configure:12060: result: /usr/bin/ld -m elf_x86_64
440
configure:12067: checking if the linker (/usr/bin/ld -m elf_x86_64) is GNU ld
441
configure:12082: result: yes
442
configure:12137: checking whether the /usr/bin/g++ linker (/usr/bin/ld -m elf_x86_64) supports shared libraries
443
configure:13142: result: yes
444
configure:13178: /usr/bin/g++ -c -g3 -gdwarf-2 conftest.cpp >&5
445
configure:13181: $? = 0
446
configure:13701: checking for /usr/bin/g++ option to produce PIC
447
configure:13708: result: -fPIC -DPIC
448
configure:13716: checking if /usr/bin/g++ PIC flag -fPIC -DPIC works
449
configure:13734: /usr/bin/g++ -c -g3 -gdwarf-2 -fPIC -DPIC -DPIC conftest.cpp >&5
450
configure:13738: $? = 0
451
configure:13751: result: yes
452
configure:13774: checking if /usr/bin/g++ static flag -static works
453
configure:13802: result: yes
454
configure:13814: checking if /usr/bin/g++ supports -c -o file.o
455
configure:13835: /usr/bin/g++ -c -g3 -gdwarf-2 -o out/conftest2.o conftest.cpp >&5
456
configure:13839: $? = 0
457
configure:13861: result: yes
458
configure:13866: checking if /usr/bin/g++ supports -c -o file.o
459
configure:13913: result: yes
460
configure:13943: checking whether the /usr/bin/g++ linker (/usr/bin/ld -m elf_x86_64) supports shared libraries
461
configure:13982: result: yes
462
configure:14123: checking dynamic linker characteristics
463
configure:14802: result: GNU/Linux ld.so
464
configure:14855: checking how to hardcode library paths into programs
465
configure:14880: result: immediate
466
configure:14950: checking for python
467
configure:14968: found /usr/bin/python
468
configure:14981: result: /usr/bin/python
469
configure:14999: /usr/bin/python -c import sys # split strings by '.' and convert to numeric. Append some zeros # because we need at least 4 digits for the hex conversion. # map returns an iterator in Python 3.0 and a list in 2.x minver = list(map(int, '2.3'.split('.'))) + [0, 0, 0] minverhex = 0 # xrange is not present in Python 3.0 and range returns an iterator for i in list(range(0, 4)): minverhex = (minverhex << 8) + minver[i] sys.exit(sys.hexversion < minverhex)
470
configure:15002: $? = 0
471
configure:15195: checking for the pthreads library -lpthreads
472
configure:15228: /usr/bin/gcc -o conftest -g3 -gdwarf-2 conftest.c -lpthreads >&5
473
/usr/bin/ld: cannot find -lpthreads
474
collect2: error: ld returned 1 exit status
475
configure:15228: $? = 1
476
configure: failed program was:
477
| /* confdefs.h */
478
| #define PACKAGE_NAME "Google C++ Testing Framework"
479
| #define PACKAGE_TARNAME "gtest"
480
| #define PACKAGE_VERSION "1.7.0"
481
| #define PACKAGE_STRING "Google C++ Testing Framework 1.7.0"
482
| #define PACKAGE_BUGREPORT "googletestframework@googlegroups.com"
483
| #define PACKAGE_URL ""
484
| #define PACKAGE "gtest"
485
| #define VERSION "1.7.0"
486
| #define STDC_HEADERS 1
487
| #define HAVE_SYS_TYPES_H 1
488
| #define HAVE_SYS_STAT_H 1
489
| #define HAVE_STDLIB_H 1
490
| #define HAVE_STRING_H 1
491
| #define HAVE_MEMORY_H 1
492
| #define HAVE_STRINGS_H 1
493
| #define HAVE_INTTYPES_H 1
494
| #define HAVE_STDINT_H 1
495
| #define HAVE_UNISTD_H 1
496
| #define HAVE_DLFCN_H 1
497
| #define LT_OBJDIR ".libs/"
498
| /* end confdefs.h. */
499
| #include <pthread.h>
500
| int
501
| main ()
502
| {
503
| pthread_t th; pthread_join(th, 0);
504
| pthread_attr_init(0); pthread_cleanup_push(0, 0);
505
| pthread_create(0,0,0,0); pthread_cleanup_pop(0);
506
| ;
507
| return 0;
508
| }
509
configure:15237: result: no
510
configure:15140: checking whether pthreads work without any flags
511
configure:15228: /usr/bin/gcc -o conftest -g3 -gdwarf-2 conftest.c >&5
512
/tmp/ccmyPrMn.o: In function `main':
513
/host/Saad/Dropbox/Projects/C++/fastmotif/gtest-1.7.0/conftest.c:27: undefined reference to `pthread_join'
514
/host/Saad/Dropbox/Projects/C++/fastmotif/gtest-1.7.0/conftest.c:28: undefined reference to `__pthread_register_cancel'
515
/host/Saad/Dropbox/Projects/C++/fastmotif/gtest-1.7.0/conftest.c:29: undefined reference to `pthread_create'
516
/host/Saad/Dropbox/Projects/C++/fastmotif/gtest-1.7.0/conftest.c:29: undefined reference to `__pthread_unregister_cancel'
517
collect2: error: ld returned 1 exit status
518
configure:15228: $? = 1
519
configure: failed program was:
520
| /* confdefs.h */
521
| #define PACKAGE_NAME "Google C++ Testing Framework"
522
| #define PACKAGE_TARNAME "gtest"
523
| #define PACKAGE_VERSION "1.7.0"
524
| #define PACKAGE_STRING "Google C++ Testing Framework 1.7.0"
525
| #define PACKAGE_BUGREPORT "googletestframework@googlegroups.com"
526
| #define PACKAGE_URL ""
527
| #define PACKAGE "gtest"
528
| #define VERSION "1.7.0"
529
| #define STDC_HEADERS 1
530
| #define HAVE_SYS_TYPES_H 1
531
| #define HAVE_SYS_STAT_H 1
532
| #define HAVE_STDLIB_H 1
533
| #define HAVE_STRING_H 1
534
| #define HAVE_MEMORY_H 1
535
| #define HAVE_STRINGS_H 1
536
| #define HAVE_INTTYPES_H 1
537
| #define HAVE_STDINT_H 1
538
| #define HAVE_UNISTD_H 1
539
| #define HAVE_DLFCN_H 1
540
| #define LT_OBJDIR ".libs/"
541
| /* end confdefs.h. */
542
| #include <pthread.h>
543
| int
544
| main ()
545
| {
546
| pthread_t th; pthread_join(th, 0);
547
| pthread_attr_init(0); pthread_cleanup_push(0, 0);
548
| pthread_create(0,0,0,0); pthread_cleanup_pop(0);
549
| ;
550
| return 0;
551
| }
552
configure:15237: result: no
553
configure:15145: checking whether pthreads work with -Kthread
554
configure:15228: /usr/bin/gcc -o conftest -g3 -gdwarf-2 -Kthread conftest.c >&5
555
gcc: error: unrecognized command line option '-Kthread'
556
configure:15228: $? = 1
557
configure: failed program was:
558
| /* confdefs.h */
559
| #define PACKAGE_NAME "Google C++ Testing Framework"
560
| #define PACKAGE_TARNAME "gtest"
561
| #define PACKAGE_VERSION "1.7.0"
562
| #define PACKAGE_STRING "Google C++ Testing Framework 1.7.0"
563
| #define PACKAGE_BUGREPORT "googletestframework@googlegroups.com"
564
| #define PACKAGE_URL ""
565
| #define PACKAGE "gtest"
566
| #define VERSION "1.7.0"
567
| #define STDC_HEADERS 1
568
| #define HAVE_SYS_TYPES_H 1
569
| #define HAVE_SYS_STAT_H 1
570
| #define HAVE_STDLIB_H 1
571
| #define HAVE_STRING_H 1
572
| #define HAVE_MEMORY_H 1
573
| #define HAVE_STRINGS_H 1
574
| #define HAVE_INTTYPES_H 1
575
| #define HAVE_STDINT_H 1
576
| #define HAVE_UNISTD_H 1
577
| #define HAVE_DLFCN_H 1
578
| #define LT_OBJDIR ".libs/"
579
| /* end confdefs.h. */
580
| #include <pthread.h>
581
| int
582
| main ()
583
| {
584
| pthread_t th; pthread_join(th, 0);
585
| pthread_attr_init(0); pthread_cleanup_push(0, 0);
586
| pthread_create(0,0,0,0); pthread_cleanup_pop(0);
587
| ;
588
| return 0;
589
| }
590
configure:15237: result: no
591
configure:15145: checking whether pthreads work with -kthread
592
configure:15228: /usr/bin/gcc -o conftest -g3 -gdwarf-2 -kthread conftest.c >&5
593
gcc: error: unrecognized command line option '-kthread'
594
configure:15228: $? = 1
595
configure: failed program was:
596
| /* confdefs.h */
597
| #define PACKAGE_NAME "Google C++ Testing Framework"
598
| #define PACKAGE_TARNAME "gtest"
599
| #define PACKAGE_VERSION "1.7.0"
600
| #define PACKAGE_STRING "Google C++ Testing Framework 1.7.0"
601
| #define PACKAGE_BUGREPORT "googletestframework@googlegroups.com"
602
| #define PACKAGE_URL ""
603
| #define PACKAGE "gtest"
604
| #define VERSION "1.7.0"
605
| #define STDC_HEADERS 1
606
| #define HAVE_SYS_TYPES_H 1
607
| #define HAVE_SYS_STAT_H 1
608
| #define HAVE_STDLIB_H 1
609
| #define HAVE_STRING_H 1
610
| #define HAVE_MEMORY_H 1
611
| #define HAVE_STRINGS_H 1
612
| #define HAVE_INTTYPES_H 1
613
| #define HAVE_STDINT_H 1
614
| #define HAVE_UNISTD_H 1
615
| #define HAVE_DLFCN_H 1
616
| #define LT_OBJDIR ".libs/"
617
| /* end confdefs.h. */
618
| #include <pthread.h>
619
| int
620
| main ()
621
| {
622
| pthread_t th; pthread_join(th, 0);
623
| pthread_attr_init(0); pthread_cleanup_push(0, 0);
624
| pthread_create(0,0,0,0); pthread_cleanup_pop(0);
625
| ;
626
| return 0;
627
| }
628
configure:15237: result: no
629
configure:15195: checking for the pthreads library -llthread
630
configure:15228: /usr/bin/gcc -o conftest -g3 -gdwarf-2 conftest.c -llthread >&5
631
/usr/bin/ld: cannot find -llthread
632
collect2: error: ld returned 1 exit status
633
configure:15228: $? = 1
634
configure: failed program was:
635
| /* confdefs.h */
636
| #define PACKAGE_NAME "Google C++ Testing Framework"
637
| #define PACKAGE_TARNAME "gtest"
638
| #define PACKAGE_VERSION "1.7.0"
639
| #define PACKAGE_STRING "Google C++ Testing Framework 1.7.0"
640
| #define PACKAGE_BUGREPORT "googletestframework@googlegroups.com"
641
| #define PACKAGE_URL ""
642
| #define PACKAGE "gtest"
643
| #define VERSION "1.7.0"
644
| #define STDC_HEADERS 1
645
| #define HAVE_SYS_TYPES_H 1
646
| #define HAVE_SYS_STAT_H 1
647
| #define HAVE_STDLIB_H 1
648
| #define HAVE_STRING_H 1
649
| #define HAVE_MEMORY_H 1
650
| #define HAVE_STRINGS_H 1
651
| #define HAVE_INTTYPES_H 1
652
| #define HAVE_STDINT_H 1
653
| #define HAVE_UNISTD_H 1
654
| #define HAVE_DLFCN_H 1
655
| #define LT_OBJDIR ".libs/"
656
| /* end confdefs.h. */
657
| #include <pthread.h>
658
| int
659
| main ()
660
| {
661
| pthread_t th; pthread_join(th, 0);
662
| pthread_attr_init(0); pthread_cleanup_push(0, 0);
663
| pthread_create(0,0,0,0); pthread_cleanup_pop(0);
664
| ;
665
| return 0;
666
| }
667
configure:15237: result: no
668
configure:15145: checking whether pthreads work with -pthread
669
configure:15228: /usr/bin/gcc -o conftest -g3 -gdwarf-2 -pthread conftest.c >&5
670
configure:15228: $? = 0
671
configure:15237: result: yes
672
configure:15256: checking for joinable pthread attribute
673
configure:15271: /usr/bin/gcc -o conftest -g3 -gdwarf-2 -pthread conftest.c >&5
674
configure:15271: $? = 0
675
configure:15277: result: PTHREAD_CREATE_JOINABLE
676
configure:15287: checking if more special flags are required for pthreads
677
configure:15294: result: no
678
configure:15383: checking whether to check for GCC pthread/shared inconsistencies
679
configure:15396: /usr/bin/gcc -o conftest -shared -fPIC -Wl,-z,defs -g3 -gdwarf-2 -pthread conftest.c >&5
680
configure:15396: $? = 0
681
configure:15408: result: yes
682
configure:15414: checking whether -pthread is sufficient with -shared
683
configure:15429: /usr/bin/gcc -o conftest -shared -fPIC -Wl,-z,defs -g3 -gdwarf-2 -pthread conftest.c >&5
684
configure:15429: $? = 0
685
configure:15436: result: yes
686
configure:15718: creating ./config.status
687
688
## ---------------------- ##
689
## Running config.status. ##
690
## ---------------------- ##
691
692
This file was extended by Google C++ Testing Framework config.status 1.7.0, which was
693
generated by GNU Autoconf 2.68. Invocation command line was
694
695
CONFIG_FILES =
696
CONFIG_HEADERS =
697
CONFIG_LINKS =
698
CONFIG_COMMANDS =
699
$ ./config.status
700
701
on ubuntu
702
703
config.status:1162: creating Makefile
704
config.status:1162: creating scripts/gtest-config
705
config.status:1162: creating build-aux/config.h
706
config.status:1391: executing depfiles commands
707
config.status:1391: executing libtool commands
708
709
## ---------------- ##
710
## Cache variables. ##
711
## ---------------- ##
712
713
ac_cv_build=x86_64-unknown-linux-gnu
714
ac_cv_c_compiler_gnu=yes
715
ac_cv_cxx_compiler_gnu=yes
716
ac_cv_env_CCC_set=
717
ac_cv_env_CCC_value=
718
ac_cv_env_CC_set=set
719
ac_cv_env_CC_value=/usr/bin/gcc
720
ac_cv_env_CFLAGS_set=set
721
ac_cv_env_CFLAGS_value='-g3 -gdwarf-2'
722
ac_cv_env_CPPFLAGS_set=
723
ac_cv_env_CPPFLAGS_value=
724
ac_cv_env_CPP_set=
725
ac_cv_env_CPP_value=
726
ac_cv_env_CXXCPP_set=
727
ac_cv_env_CXXCPP_value=
728
ac_cv_env_CXXFLAGS_set=set
729
ac_cv_env_CXXFLAGS_value='-g3 -gdwarf-2'
730
ac_cv_env_CXX_set=set
731
ac_cv_env_CXX_value=/usr/bin/g++
732
ac_cv_env_LDFLAGS_set=
733
ac_cv_env_LDFLAGS_value=
734
ac_cv_env_LIBS_set=
735
ac_cv_env_LIBS_value=
736
ac_cv_env_build_alias_set=
737
ac_cv_env_build_alias_value=
738
ac_cv_env_host_alias_set=
739
ac_cv_env_host_alias_value=
740
ac_cv_env_target_alias_set=
741
ac_cv_env_target_alias_value=
742
ac_cv_header_dlfcn_h=yes
743
ac_cv_header_inttypes_h=yes
744
ac_cv_header_memory_h=yes
745
ac_cv_header_stdc=yes
746
ac_cv_header_stdint_h=yes
747
ac_cv_header_stdlib_h=yes
748
ac_cv_header_string_h=yes
749
ac_cv_header_strings_h=yes
750
ac_cv_header_sys_stat_h=yes
751
ac_cv_header_sys_types_h=yes
752
ac_cv_header_unistd_h=yes
753
ac_cv_host=x86_64-unknown-linux-gnu
754
ac_cv_objext=o
755
ac_cv_path_EGREP='/bin/grep -E'
756
ac_cv_path_FGREP='/bin/grep -F'
757
ac_cv_path_GREP=/bin/grep
758
ac_cv_path_PYTHON=/usr/bin/python
759
ac_cv_path_SED=/bin/sed
760
ac_cv_path_install='/usr/bin/install -c'
761
ac_cv_path_mkdir=/bin/mkdir
762
ac_cv_prog_AWK=mawk
763
ac_cv_prog_CPP='/usr/bin/gcc -E'
764
ac_cv_prog_CXXCPP='/usr/bin/g++ -E'
765
ac_cv_prog_ac_ct_AR=ar
766
ac_cv_prog_ac_ct_CC=/usr/bin/gcc
767
ac_cv_prog_ac_ct_MANIFEST_TOOL=mt
768
ac_cv_prog_ac_ct_OBJDUMP=objdump
769
ac_cv_prog_ac_ct_RANLIB=ranlib
770
ac_cv_prog_ac_ct_STRIP=strip
771
ac_cv_prog_cc_c89=
772
ac_cv_prog_cc_g=yes
773
ac_cv_prog_cxx_g=yes
774
ac_cv_prog_make_make_set=yes
775
am_cv_CC_dependencies_compiler_type=gcc3
776
am_cv_CXX_dependencies_compiler_type=gcc3
777
lt_cv_ar_at_file=@
778
lt_cv_archive_cmds_need_lc=no
779
lt_cv_deplibs_check_method=pass_all
780
lt_cv_file_magic_cmd='$MAGIC_CMD'
781
lt_cv_file_magic_test_file=
782
lt_cv_ld_reload_flag=-r
783
lt_cv_nm_interface='BSD nm'
784
lt_cv_objdir=.libs
785
lt_cv_path_LD=/usr/bin/ld
786
lt_cv_path_LDCXX='/usr/bin/ld -m elf_x86_64'
787
lt_cv_path_NM='/usr/bin/nm -B'
788
lt_cv_path_mainfest_tool=no
789
lt_cv_prog_compiler_c_o=yes
790
lt_cv_prog_compiler_c_o_CXX=yes
791
lt_cv_prog_compiler_pic='-fPIC -DPIC'
792
lt_cv_prog_compiler_pic_CXX='-fPIC -DPIC'
793
lt_cv_prog_compiler_pic_works=yes
794
lt_cv_prog_compiler_pic_works_CXX=yes
795
lt_cv_prog_compiler_rtti_exceptions=no
796
lt_cv_prog_compiler_static_works=yes
797
lt_cv_prog_compiler_static_works_CXX=yes
798
lt_cv_prog_gnu_ld=yes
799
lt_cv_prog_gnu_ldcxx=yes
800
lt_cv_sharedlib_from_linklib_cmd='printf %s\n'
801
lt_cv_shlibpath_overrides_runpath=no
802
lt_cv_sys_global_symbol_pipe='sed -n -e '\''s/^.*[ ]\([ABCDGIRSTW][ABCDGIRSTW]*\)[ ][ ]*\([_A-Za-z][_A-Za-z0-9]*\)$/\1 \2 \2/p'\'' | sed '\''/ __gnu_lto/d'\'''
803
lt_cv_sys_global_symbol_to_c_name_address='sed -n -e '\''s/^: \([^ ]*\)[ ]*$/ {\"\1\", (void *) 0},/p'\'' -e '\''s/^[ABCDGIRSTW]* \([^ ]*\) \([^ ]*\)$/ {"\2", (void *) \&\2},/p'\'''
804
lt_cv_sys_global_symbol_to_c_name_address_lib_prefix='sed -n -e '\''s/^: \([^ ]*\)[ ]*$/ {\"\1\", (void *) 0},/p'\'' -e '\''s/^[ABCDGIRSTW]* \([^ ]*\) \(lib[^ ]*\)$/ {"\2", (void *) \&\2},/p'\'' -e '\''s/^[ABCDGIRSTW]* \([^ ]*\) \([^ ]*\)$/ {"lib\2", (void *) \&\2},/p'\'''
805
lt_cv_sys_global_symbol_to_cdecl='sed -n -e '\''s/^T .* \(.*\)$/extern int \1();/p'\'' -e '\''s/^[ABCDGIRSTW]* .* \(.*\)$/extern char \1;/p'\'''
806
lt_cv_sys_max_cmd_len=1572864
807
lt_cv_to_host_file_cmd=func_convert_file_noop
808
lt_cv_to_tool_file_cmd=func_convert_file_noop
809
810
## ----------------- ##
811
## Output variables. ##
812
## ----------------- ##
813
814
ACLOCAL='${SHELL} /host/Saad/Dropbox/Projects/C++/fastmotif/gtest-1.7.0/build-aux/missing --run aclocal-1.11'
815
AMDEPBACKSLASH='\'
816
AMDEP_FALSE='#'
817
AMDEP_TRUE=''
818
AMTAR='$${TAR-tar}'
819
AR='ar'
820
AUTOCONF='${SHELL} /host/Saad/Dropbox/Projects/C++/fastmotif/gtest-1.7.0/build-aux/missing --run autoconf'
821
AUTOHEADER='${SHELL} /host/Saad/Dropbox/Projects/C++/fastmotif/gtest-1.7.0/build-aux/missing --run autoheader'
822
AUTOMAKE='${SHELL} /host/Saad/Dropbox/Projects/C++/fastmotif/gtest-1.7.0/build-aux/missing --run automake-1.11'
823
AWK='mawk'
824
CC='/usr/bin/gcc'
825
CCDEPMODE='depmode=gcc3'
826
CFLAGS='-g3 -gdwarf-2'
827
CPP='/usr/bin/gcc -E'
828
CPPFLAGS=''
829
CXX='/usr/bin/g++'
830
CXXCPP='/usr/bin/g++ -E'
831
CXXDEPMODE='depmode=gcc3'
832
CXXFLAGS='-g3 -gdwarf-2'
833
CYGPATH_W='echo'
834
DEFS='-DHAVE_CONFIG_H'
835
DEPDIR='.deps'
836
DLLTOOL='false'
837
DSYMUTIL=''
838
DUMPBIN=''
839
ECHO_C=''
840
ECHO_N='-n'
841
ECHO_T=''
842
EGREP='/bin/grep -E'
843
EXEEXT=''
844
FGREP='/bin/grep -F'
845
GREP='/bin/grep'
846
HAVE_PTHREADS_FALSE='#'
847
HAVE_PTHREADS_TRUE=''
848
HAVE_PYTHON_FALSE='#'
849
HAVE_PYTHON_TRUE=''
850
INSTALL_DATA='${INSTALL} -m 644'
851
INSTALL_PROGRAM='${INSTALL}'
852
INSTALL_SCRIPT='${INSTALL}'
853
INSTALL_STRIP_PROGRAM='$(install_sh) -c -s'
854
LD='/usr/bin/ld -m elf_x86_64'
855
LDFLAGS=''
856
LIBOBJS=''
857
LIBS=''
858
LIBTOOL='$(SHELL) $(top_builddir)/libtool'
859
LIPO=''
860
LN_S='ln -s'
861
LTLIBOBJS=''
862
MAKEINFO='${SHELL} /host/Saad/Dropbox/Projects/C++/fastmotif/gtest-1.7.0/build-aux/missing --run makeinfo'
863
MANIFEST_TOOL=':'
864
MKDIR_P='/bin/mkdir -p'
865
NM='/usr/bin/nm -B'
866
NMEDIT=''
867
OBJDUMP='objdump'
868
OBJEXT='o'
869
OTOOL64=''
870
OTOOL=''
871
PACKAGE='gtest'
872
PACKAGE_BUGREPORT='googletestframework@googlegroups.com'
873
PACKAGE_NAME='Google C++ Testing Framework'
874
PACKAGE_STRING='Google C++ Testing Framework 1.7.0'
875
PACKAGE_TARNAME='gtest'
876
PACKAGE_URL=''
877
PACKAGE_VERSION='1.7.0'
878
PATH_SEPARATOR=':'
879
PTHREAD_CC='/usr/bin/gcc'
880
PTHREAD_CFLAGS='-pthread'
881
PTHREAD_LIBS=''
882
PYTHON='/usr/bin/python'
883
RANLIB='ranlib'
884
SED='/bin/sed'
885
SET_MAKE=''
886
SHELL='/bin/bash'
887
STRIP='strip'
888
VERSION='1.7.0'
889
ac_ct_AR='ar'
890
ac_ct_CC='/usr/bin/gcc'
891
ac_ct_CXX=''
892
ac_ct_DUMPBIN=''
893
acx_pthread_config=''
894
am__EXEEXT_FALSE=''
895
am__EXEEXT_TRUE='#'
896
am__fastdepCC_FALSE='#'
897
am__fastdepCC_TRUE=''
898
am__fastdepCXX_FALSE='#'
899
am__fastdepCXX_TRUE=''
900
am__include='include'
901
am__isrc=''
902
am__leading_dot='.'
903
am__nodep='_no'
904
am__quote=''
905
am__tar='$${TAR-tar} chof - "$$tardir"'
906
am__untar='$${TAR-tar} xf -'
907
bindir='${exec_prefix}/bin'
908
build='x86_64-unknown-linux-gnu'
909
build_alias=''
910
build_cpu='x86_64'
911
build_os='linux-gnu'
912
build_vendor='unknown'
913
datadir='${datarootdir}'
914
datarootdir='${prefix}/share'
915
docdir='${datarootdir}/doc/${PACKAGE_TARNAME}'
916
dvidir='${docdir}'
917
exec_prefix='${prefix}'
918
host='x86_64-unknown-linux-gnu'
919
host_alias=''
920
host_cpu='x86_64'
921
host_os='linux-gnu'
922
host_vendor='unknown'
923
htmldir='${docdir}'
924
includedir='${prefix}/include'
925
infodir='${datarootdir}/info'
926
install_sh='${SHELL} /host/Saad/Dropbox/Projects/C++/fastmotif/gtest-1.7.0/build-aux/install-sh'
927
libdir='${exec_prefix}/lib'
928
libexecdir='${exec_prefix}/libexec'
929
localedir='${datarootdir}/locale'
930
localstatedir='${prefix}/var'
931
mandir='${datarootdir}/man'
932
mkdir_p='/bin/mkdir -p'
933
oldincludedir='/usr/include'
934
pdfdir='${docdir}'
935
prefix='/usr/local'
936
program_transform_name='s,x,x,'
937
psdir='${docdir}'
938
sbindir='${exec_prefix}/sbin'
939
sharedstatedir='${prefix}/com'
940
sysconfdir='${prefix}/etc'
941
target_alias=''
942
943
## ----------- ##
944
## confdefs.h. ##
945
## ----------- ##
946
947
/* confdefs.h */
948
#define PACKAGE_NAME "Google C++ Testing Framework"
949
#define PACKAGE_TARNAME "gtest"
950
#define PACKAGE_VERSION "1.7.0"
951
#define PACKAGE_STRING "Google C++ Testing Framework 1.7.0"
952
#define PACKAGE_BUGREPORT "googletestframework@googlegroups.com"
953
#define PACKAGE_URL ""
954
#define PACKAGE "gtest"
955
#define VERSION "1.7.0"
956
#define STDC_HEADERS 1
957
#define HAVE_SYS_TYPES_H 1
958
#define HAVE_SYS_STAT_H 1
959
#define HAVE_STDLIB_H 1
960
#define HAVE_STRING_H 1
961
#define HAVE_MEMORY_H 1
962
#define HAVE_STRINGS_H 1
963
#define HAVE_INTTYPES_H 1
964
#define HAVE_STDINT_H 1
965
#define HAVE_UNISTD_H 1
966
#define HAVE_DLFCN_H 1
967
#define LT_OBJDIR ".libs/"
968
#define HAVE_PTHREAD 1
969
970
configure: exit 0
You can’t perform that action at this time.